{"text_format":"1","workbook":"xlsx","n_sheets":4,"sheets":["指定納品書","指定納品書 （工事）","指定納品書（工事以外【工場】）","Sheet1"],"not_rendered":{"charts":0,"images":0,"macros":1,"external_links":0,"defined_names":3,"comments":3,"pivot_tables":0},"unopened":[],"bounds":{"document_bytes":16777216,"sheet_cells":100000,"rows_first":2000,"rows_last":500,"rows_between":2000,"halvings":0,"cell_chars":16384,"cell_head_chars":4096},"cells_cut":0,"cells_raw":0,"read":"whole","date_system":"1900"}

{"sheet":"指定納品書","index":0,"n_rows":51,"n_cols":37,"rows_kept":51,"cut":false,"hidden":false,"merged":[[4,27,4,31],[30,27,30,31],[50,2,50,10],[50,11,50,16],[50,17,50,18],[49,2,49,10],[49,11,49,16],[49,17,49,18],[41,12,41,20],[43,12,43,20],[40,12,40,20],[42,12,42,20],[40,2,40,11],[41,2,41,11],[42,2,42,11],[48,21,48,25],[49,21,50,25],[40,26,40,31],[43,26,43,31],[48,26,50,26],[48,27,50,31],[6,23,6,30],[7,23,7,30],[31,2,31,8],[2,26,2,31],[24,2,24,10],[23,2,23,10],[31,15,31,20],[33,15,33,20],[13,12,13,20],[14,12,14,20],[15,12,15,20],[17,12,17,20],[2,0,2,2],[28,0,28,2],[3,2,4,19],[23,11,23,16],[32,15,32,20],[33,9,33,14],[18,22,19,23],[17,24,17,25],[9,22,9,31],[18,24,19,25],[22,24,22,25],[23,24,24,25],[14,24,14,25],[15,24,15,25],[11,23,12,23],[32,9,32,14],[2,19,2,22],[28,19,28,22],[9,9,9,10],[23,17,23,18],[5,15,5,20],[6,15,6,20],[7,15,7,20],[5,9,5,14],[7,9,7,14],[6,9,6,14],[11,21,12,21],[11,22,12,22],[18,2,19,21],[13,2,13,11],[14,2,14,11],[15,2,15,11],[16,2,16,11],[17,2,17,11],[5,2,5,8],[6,2,6,8],[10,10,10,12],[10,14,10,16],[5,23,5,29],[32,23,32,29],[23,29,24,31],[31,23,31,29],[18,26,19,31],[24,20,24,21],[24,17,24,18],[24,11,24,16],[11,12,12,20],[23,23,24,23],[16,12,16,20],[13,24,13,25],[17,26,17,31],[8,23,8,30],[16,24,16,25],[11,24,12,25],[11,26,12,31],[22,26,22,31],[13,26,13,31],[14,26,14,31],[15,26,15,31],[16,26,16,31],[23,26,24,28],[28,26,28,31],[43,24,43,25],[44,2,45,21],[44,24,45,25],[44,22,45,23],[43,2,43,11],[41,26,41,31],[39,26,39,31],[39,12,39,20],[39,2,39,11],[42,26,42,31],[44,26,45,31],[39,24,39,25],[40,24,40,25],[41,24,41,25],[42,24,42,25],[37,23,38,23],[37,24,38,25],[37,26,38,31],[37,12,38,20],[37,22,38,22],[11,2,12,11],[7,2,9,8],[8,9,8,14],[9,15,9,20],[8,15,8,18],[8,19,8,20],[37,2,38,11],[33,2,35,8],[34,9,34,14],[35,9,35,14],[35,15,35,20],[34,15,34,18],[34,19,34,20],[37,21,38,21],[34,23,34,29],[33,23,33,29],[34,30,34,31],[32,2,32,8],[31,9,31,14]]}
[]
[]
[null,null,null,null,null,null,null,null,null,null,null,null,null,null,null,null,null,null,null,"納　　品　　書",null,null,null,null,null,"納品日",null,null,null,null,null,null,null,null,null,"着色部をご記入ください"]
[null,null,"昭和コンクリート工業株式会社　殿"]
[null,null,null,null,null,null,null,null,null,null,null,null,null,null,null,null,null,null,null,null,null,null,"業者コード",null,null,"登録番号","Ｔ",null,null,null,null,null,null,1,"納品日ごとに作成してください。"]
[null,null,"申請事業所",null,null,null,null,null,null,null,null,null,null,null,null,null,null,null,null,null,null,null,null,null,null,null,null,null,null,null,null,null,null,2,"納入場所は納品書と受領書共にチェックを入れてください。"]
[null,null,"工　事　名",null,null,null,null,null,null,null,null,null,null,null,null,null,null,null,null,null,null,null,"納入業者名",null,null,null,null,null,null,null,null,null,null,null,"（その他の場合、納入場所を記入のこと）"]
[null,null,"納入場所",null,null,null,null,null,null,null,null,null,null,null,null,null,null,null,null,null,null,null,"住所",null,null,null,null,null,null,null,null,null,null,3,"納入業者名は住所及び社名を必ず記入。（ゴム印使用可）"]
[null,null,null,null,null,null,null,null,null,null,null,null,null,null,null,{"$f":"IF(T9=\"\",\"\",VLOOKUP(T9,Sheet1!E5:F13,2,FALSE))","v":""},null,null,null,null,null,null,"社名",null,null,null,null,null,null,null,null,null,null,null,"社印の押印は省略とします。"]
[null,null,null,null,null,null,null,null,null,null,null,null,null,null,null,null,null,null,null,null,null,null,"下記の通り納品致しましたのでご査収願います。",null,null,null,null,null,null,null,null,null,null,4,"ご記入はオーダー表または、注文書の内容通り記載願います。"]
[null,null,null,null,null,null,null,null,null,null,null,null,null,null,null,null,null,null,null,null,null,null,null,null,null,null,null,null,null,null,null,null,null,null,"（資材コード欄はオーダー№を必ず記入。追加等でオーダー№が無い場合は資材コードを記入）"]
[null,null,"オーダーＮｏ．",null,null,null,null,null,null,null,null,null,"品名  　 規格　 　寸法",null,null,null,null,null,null,null,null,"単位","数  量","単　価","金　額",null,"備　考",null,null,null,null,null,null,null,"　＊規定桁数を超える番号の入力をするとエラーメッセージが表示されます。（0～999999999）"]
[null,null,null,null,null,null,null,null,null,null,null,null,null,null,null,null,null,null,null,null,null,null,null,null,null,null,null,null,null,null,null,null,null,5,"オーダー№の番号順の変更不可（末尾１からご記入下さい）"]
[null,null,null,null,null,null,null,null,null,null,null,null,null,null,null,null,null,null,null,null,null,null,null,null,{"$f":"ROUND(W14*X14,0)","v":0},null,null,null,null,null,null,null,null,6,"納品日・業者コード・注文日・注文№・発注者（調達担当者）は必ずご記入下さい。"]
[null,null,null,null,null,null,null,null,null,null,null,null,null,null,null,null,null,null,null,null,null,null,null,null,{"$f":"ROUND(W15*X15,0)","v":0},null,null,null,null,null,null,null,null,7,"記入された納品書は担当者へメールまたはＦＡＸにてお送り下さい。"]
[null,null,null,null,null,null,null,null,null,null,null,null,null,null,null,null,null,null,null,null,null,null,null,null,{"$f":"ROUND(W16*X16,0)","v":0}]
[null,null,null,null,null,null,null,null,null,null,null,null,null,null,null,null,null,null,null,null,null,null,null,null,{"$f":"ROUND(W17*X17,0)","v":0},null,null,null,null,null,null,null,null,8,"オーダーＮｏ．の無い工場向け鉄筋の番号について"]
[null,null,null,null,null,null,null,null,null,null,null,null,null,null,null,null,null,null,null,null,null,null,null,null,{"$f":"ROUND(W18*X18,0)","v":0},null,null,null,null,null,null,null,null,null,null,"SD345","D10　：　４６０１００１"]
[null,null,null,null,null,null,null,null,null,null,null,null,null,null,null,null,null,null,null,null,null,null,"税抜合計金額",null,{"$f":"SUM(Y14:Z18)","v":0}]
[]
[]
[]
[null,null,null,null,null,null,null,null,null,null,null,null,null,null,null,null,null,null,null,null,null,null,null,"照合印","検収印",null,"入力者印",null,null,null,null,null,null,null,null,"SD295","D10　：　４５０１００１"]
[null,null,"受注日",null,null,null,null,null,null,null,null,"注文NO.",null,null,null,null,null,"発注者"]
[]
[]
[]
[]
[null,null,null,null,null,null,null,null,null,null,{"$f":"IF(K3=\"\",\"\",K3)","v":""},null,null,null,null,null,null,null,null,"受　　領　　書",null,null,null,null,null,"納品日",{"$f":"IF(AA3=\"\",\"\",AA3)","v":""}]
[]
[null,null,null,null,null,null,null,null,null,null,null,null,null,null,null,null,null,null,null,null,null,null,"業者コード",{"$f":"IF(X5=\"\",\"\",X5)","v":""},null,"登録番号",{"$f":"IF(AA5=\"\",\"\",AA5)","v":"Ｔ"},"","","","",""]
[null,null,"申請事業所",null,null,null,null,null,null,{"$f":"IF(J6=\"\",\"\",J6)","v":""},null,null,null,null,null,{"$f":"IF(P6=\"\",\"\",P6)","v":""},null,null,null,null,null,null,null,{"$f":"IF(+X6=\"\",\"\",X6)","v":""}]
[null,null,"工　事　名",null,null,null,null,null,null,{"$f":"IF(J7=\"\",\"\",J7)","v":""},null,null,null,null,null,{"$f":"IF(P7=\"\",\"\",P7)","v":""},null,null,null,null,null,null,"納入業者名",{"$f":"IF(+X7=\"\",\"\",X7)","v":""}]
[null,null,"納入場所",null,null,null,null,null,null,{"$f":"IF(J8=\"\",\"\",J8)","v":""},null,null,null,null,null,{"$f":"IF(P8=\"\",\"\",P8)","v":""},null,null,null,null,null,null,{"$f":"IF(+W8=\"\",\"\",W8)","v":"住所"},{"$f":"IF(+X8=\"\",\"\",X8)","v":""}]
[null,null,null,null,null,null,null,null,null,null,null,null,null,null,null,{"$f":"IF(P9=\"\",\"\",P9)","v":""},null,null,null,{"$f":"IF(T9=\"\",\"\",T9)","v":""},null,null,{"$f":"IF(+W9=\"\",\"\",W9)","v":"社名"},{"$f":"IF(+X9=\"\",\"\",X9)","v":""},null,null,null,null,null,null,"御中"]
[null,null,null,null,null,null,null,null,null,null,null,null,null,null,null,{"$f":"IF(P10=\"\",\"\",P10)","v":""}]
[]
[null,null,"オーダー№",null,null,null,null,null,null,null,null,null,"品名  　 規格　 　寸法",null,null,null,null,null,null,null,null,"単位","数  量","単　価","金　額",null,"摘　要"]
[]
[null,null,{"$f":"IF(C14=\"\",\"\",C14)","v":""},null,null,null,null,null,null,null,null,null,{"$f":"IF(M14=\"\",\"\",M14)","v":""},null,null,null,null,null,null,null,null,{"$f":"IF(V14=\"\",\"\",V14)","v":""},"","",0]
{"$rows_left_out":12}
{"sheet":"指定納品書 （工事）","index":1,"n_rows":51,"n_cols":37,"rows_kept":51,"cut":false,"hidden":false,"merged":[[2,0,2,2],[2,19,2,22],[2,26,2,31],[3,2,4,19],[4,27,4,31],[5,2,5,8],[5,9,5,14],[5,15,5,20],[5,23,5,29],[8,19,8,20],[9,9,9,10],[9,15,9,20],[9,22,9,31],[10,10,10,12],[10,14,10,16],[7,23,8,30],[6,2,6,8],[6,9,6,14],[6,15,6,20],[6,23,6,30],[7,2,9,8],[7,9,7,14],[7,15,7,20],[8,9,8,14],[8,15,8,18],[11,26,12,31],[13,2,13,11],[13,12,13,20],[13,24,13,25],[13,26,13,31],[14,2,14,11],[14,12,14,20],[14,24,14,25],[14,26,14,31],[11,2,12,11],[11,12,12,20],[11,21,12,21],[11,22,12,22],[11,23,12,23],[11,24,12,25],[17,2,17,11],[17,12,17,20],[17,24,17,25],[17,26,17,31],[18,2,19,21],[18,22,19,23],[18,24,19,25],[18,26,19,31],[15,2,15,11],[15,12,15,20],[15,24,15,25],[15,26,15,31],[16,2,16,11],[16,12,16,20],[16,24,16,25],[16,26,16,31],[24,11,24,16],[24,17,24,18],[24,20,24,21],[28,0,28,2],[28,19,28,22],[28,26,28,31],[22,24,22,25],[22,26,22,31],[23,2,23,10],[23,11,23,16],[23,17,23,18],[23,23,24,23],[23,24,24,25],[23,26,24,28],[23,29,24,31],[24,2,24,10],[34,19,34,20],[34,23,34,29],[30,27,30,31],[31,2,31,8],[31,9,31,14],[31,15,31,20],[31,23,31,29],[32,2,32,8],[32,9,32,14],[32,15,32,20],[32,23,32,29],[39,2,39,11],[39,12,39,20],[39,24,39,25],[39,26,39,31],[40,2,40,11],[40,12,40,20],[40,24,40,25],[40,26,40,31],[34,30,34,31],[35,9,35,14],[35,15,35,20],[37,2,38,11],[37,12,38,20],[37,21,38,21],[37,22,38,22],[37,23,38,23],[37,24,38,25],[37,26,38,31],[33,2,35,8],[33,9,33,14],[33,15,33,20],[33,23,33,29],[34,9,34,14],[34,15,34,18],[43,2,43,11],[43,12,43,20],[43,24,43,25],[43,26,43,31],[44,2,45,21],[44,22,45,23],[44,24,45,25],[44,26,45,31],[41,2,41,11],[41,12,41,20],[41,24,41,25],[41,26,41,31],[42,2,42,11],[42,12,42,20],[42,24,42,25],[42,26,42,31],[48,21,48,25],[48,26,50,26],[48,27,50,31],[49,2,49,10],[49,11,49,16],[49,17,49,18],[49,21,50,25],[50,2,50,10],[50,11,50,16],[50,17,50,18]]}
[]
[]
[null,null,null,null,null,null,null,null,null,null,null,null,null,null,null,null,null,null,null,"納　　品　　書",null,null,null,null,null,"納品日","2023-10-01",null,null,null,null,null,null,null,null,"着色部をご記入ください"]
[null,null,"昭和コンクリート工業株式会社　殿"]
[null,null,null,null,null,null,null,null,null,null,null,null,null,null,null,null,null,null,null,null,null,null,"業者コード",11111,null,"登録番号","Ｔ","1234567891234",null,null,null,null,null,1,"納品日ごとに作成してください。"]
[null,null,"申請事業所",null,null,null,null,null,null,98159,null,null,null,null,null,"技術工事本部",null,null,null,null,null,null,null,null,null,null,null,null,null,null,null,null,null,2,"納入場所は納品書と受領書共にチェックを入れてください。"]
[null,null,"工　事　名",null,null,null,null,null,null,221127,null,null,null,null,null,"〇〇橋　ｏｒ　工事名",null,null,null,null,null,null,"納入業者名",null,null,null,null,null,null,null,null,null,null,null,"（その他の場合、納入場所を記入のこと）"]
[null,null,"納入場所",null,null,null,null,null,null,null,null,null,null,null,null,null,null,null,null,null,null,null,"住所","必ずご記入願います（ゴム印可）",null,null,null,null,null,null,null,null,null,3,"納入業者名は住所及び社名を必ず記入。（ゴム印使用可）"]
[null,null,null,null,null,null,null,null,null,null,null,null,null,null,null,{"$f":"IF(T9=\"\",\"\",VLOOKUP(T9,Sheet1!E5:F13,2,FALSE))","v":98101},null,null,null,"揖斐川工場",null,null,"社名",null,null,null,null,null,null,null,null,null,null,null,"社印の押印は省略とします。"]
[null,null,null,null,null,null,null,null,null,null,null,null,null,null,null,null,null,null,null,null,null,null,"下記の通り納品致しましたのでご査収願います。",null,null,null,null,null,null,null,null,null,null,4,"ご記入はオーダー表または、注文書の内容通り記載願います。"]
[null,null,null,null,null,null,null,null,null,null,null,null,null,null,null,null,null,null,null,null,null,null,null,null,null,null,null,null,null,null,null,null,null,null,"（資材コード欄はオーダー№を必ず記入。追加等でオーダー№が無い場合は資材コードを記入）"]
[null,null,"オーダーＮｏ．",null,null,null,null,null,null,null,null,null,"品名  　 規格　 　寸法",null,null,null,null,null,null,null,null,"単位","数  量","単　価","金　額",null,"備　考",null,null,null,null,null,null,null,"　＊規定桁数を超える番号の入力をするとエラーメッセージが表示されます。（0～999999999）"]
[null,null,null,null,null,null,null,null,null,null,null,null,null,null,null,null,null,null,null,null,null,null,null,null,null,null,null,null,null,null,null,null,null,5,"オーダー№の番号順の変更不可（末尾１からご記入下さい）"]
[null,null,11905001,null,null,null,null,null,null,null,null,null,"商品名他オーダー表の表示通り記入",null,null,null,null,null,null,null,null,"枚",3,4000,{"$f":"ROUND(W14*X14,0)","v":12000},null,null,null,null,null,null,null,null,6,"納品日・業者コード・注文日・注文№・発注者（調達担当者）は必ずご記入下さい。"]
[null,null,19080000,null,null,null,null,null,null,null,null,null,"運賃",null,null,null,null,null,null,null,null,"式",1,3700,{"$f":"ROUND(W15*X15,0)","v":3700},null,null,null,null,null,null,null,null,7,"記入された納品書は担当者へメールまたはＦＡＸにてお送り下さい。"]
[null,null,null,null,null,null,null,null,null,null,null,null,null,null,null,null,null,null,null,null,null,null,null,null,{"$f":"ROUND(W16*X16,0)","v":0}]
[null,null,null,null,null,null,null,null,null,null,null,null,null,null,null,null,null,null,null,null,null,null,null,null,{"$f":"ROUND(W17*X17,0)","v":0},null,null,null,null,null,null,null,null,8,"オーダーＮｏ．の無い工場向け鉄筋の番号について"]
[null,null,null,null,null,null,null,null,null,null,null,null,null,null,null,null,null,null,null,null,null,null,null,null,{"$f":"ROUND(W18*X18,0)","v":0},null,null,null,null,null,null,null,null,null,null,"SD345","D10　：　４６０１００１"]
[null,null,null,null,null,null,null,null,null,null,null,null,null,null,null,null,null,null,null,null,null,null,"税抜合計金額",null,{"$f":"SUM(Y14:Z18)","v":15700}]
[]
[]
[]
[null,null,null,null,null,null,null,null,null,null,null,null,null,null,null,null,null,null,null,null,null,null,null,"照合印","検収印",null,"入力者印",null,null,null,null,null,null,null,null,"SD295","D10　：　４５０１００１"]
[null,null,"受注日",null,null,null,null,null,null,null,null,"注文NO.",null,null,null,null,null,"発注者"]
[null,null,"2023-09-20",null,null,null,null,null,null,null,null,1,null,null,null,null,null,"吉田"]
[]
[]
[]
[null,null,null,null,null,null,null,null,null,null,{"$f":"IF(K3=\"\",\"\",K3)","v":""},null,null,null,null,null,null,null,null,"受　　領　　書",null,null,null,null,null,"納品日",{"$f":"IF(AA3=\"\",\"\",AA3)","v":"2023-10-01"}]
[]
[null,null,null,null,null,null,null,null,null,null,null,null,null,null,null,null,null,null,null,null,null,null,"業者コード",{"$f":"IF(X5=\"\",\"\",X5)","v":11111},null,"登録番号",{"$f":"IF(AA5=\"\",\"\",AA5)","v":"Ｔ"},"1234567891234","","","",""]
[null,null,"申請事業所",null,null,null,null,null,null,{"$f":"IF(J6=\"\",\"\",J6)","v":98159},null,null,null,null,null,{"$f":"IF(P6=\"\",\"\",P6)","v":"技術工事本部"},null,null,null,null,null,null,null,{"$f":"IF(+X6=\"\",\"\",X6)","v":""}]
[null,null,"工　事　名",null,null,null,null,null,null,{"$f":"IF(J7=\"\",\"\",J7)","v":221127},null,null,null,null,null,{"$f":"IF(P7=\"\",\"\",P7)","v":"〇〇橋　ｏｒ　工事名"},null,null,null,null,null,null,"納入業者名",{"$f":"IF(+X7=\"\",\"\",X7)","v":""}]
[null,null,"納入場所",null,null,null,null,null,null,{"$f":"IF(J8=\"\",\"\",J8)","v":""},null,null,null,null,null,{"$f":"IF(P8=\"\",\"\",P8)","v":""},null,null,null,null,null,null,{"$f":"IF(+W8=\"\",\"\",W8)","v":"住所"},{"$f":"IF(+X8=\"\",\"\",X8)","v":"必ずご記入願います（ゴム印可）"}]
[null,null,null,null,null,null,null,null,null,null,null,null,null,null,null,{"$f":"IF(P9=\"\",\"\",P9)","v":98101},null,null,null,{"$f":"IF(T9=\"\",\"\",T9)","v":"揖斐川工場"},null,null,{"$f":"IF(+W9=\"\",\"\",W9)","v":"社名"},{"$f":"IF(+X9=\"\",\"\",X9)","v":""},null,null,null,null,null,null,"御中"]
[null,null,null,null,null,null,null,null,null,null,null,null,null,null,null,{"$f":"IF(P10=\"\",\"\",P10)","v":""}]
[]
[null,null,"オーダー№",null,null,null,null,null,null,null,null,null,"品名  　 規格　 　寸法",null,null,null,null,null,null,null,null,"単位","数  量","単　価","金　額",null,"摘　要"]
[]
[null,null,{"$f":"IF(C14=\"\",\"\",C14)","v":11905001},null,null,null,null,null,null,null,null,null,{"$f":"IF(M14=\"\",\"\",M14)","v":"商品名他オーダー表の表示通り記入"},null,null,null,null,null,null,null,null,{"$f":"IF(V14=\"\",\"\",V14)","v":"枚"},3,4000,12000]
{"$rows_left_out":12}
{"sheet":"指定納品書（工事以外【工場】）","index":2,"n_rows":51,"n_cols":37,"rows_kept":51,"cut":false,"hidden":false,"merged":[[2,0,2,2],[2,19,2,22],[2,26,2,31],[3,2,4,19],[4,27,4,31],[5,2,5,8],[5,9,5,14],[5,15,5,20],[5,23,5,29],[8,19,8,20],[9,9,9,10],[9,15,9,20],[9,22,9,31],[10,10,10,12],[10,14,10,16],[7,23,8,30],[6,2,6,8],[6,9,6,14],[6,15,6,20],[6,23,6,30],[7,2,9,8],[7,9,7,14],[7,15,7,20],[8,9,8,14],[8,15,8,18],[11,26,12,31],[13,2,13,11],[13,12,13,20],[13,24,13,25],[13,26,13,31],[14,2,14,11],[14,12,14,20],[14,24,14,25],[14,26,14,31],[11,2,12,11],[11,12,12,20],[11,21,12,21],[11,22,12,22],[11,23,12,23],[11,24,12,25],[17,2,17,11],[17,12,17,20],[17,24,17,25],[17,26,17,31],[18,2,19,21],[18,22,19,23],[18,24,19,25],[18,26,19,31],[15,2,15,11],[15,12,15,20],[15,24,15,25],[15,26,15,31],[16,2,16,11],[16,12,16,20],[16,24,16,25],[16,26,16,31],[24,11,24,16],[24,17,24,18],[24,20,24,21],[28,0,28,2],[28,19,28,22],[28,26,28,31],[22,24,22,25],[22,26,22,31],[23,2,23,10],[23,11,23,16],[23,17,23,18],[23,23,24,23],[23,24,24,25],[23,26,24,28],[23,29,24,31],[24,2,24,10],[34,19,34,20],[34,23,34,29],[30,27,30,31],[31,2,31,8],[31,9,31,14],[31,15,31,20],[31,23,31,29],[32,2,32,8],[32,9,32,14],[32,15,32,20],[32,23,32,29],[39,2,39,11],[39,12,39,20],[39,24,39,25],[39,26,39,31],[40,2,40,11],[40,12,40,20],[40,24,40,25],[40,26,40,31],[34,30,34,31],[35,9,35,14],[35,15,35,20],[37,2,38,11],[37,12,38,20],[37,21,38,21],[37,22,38,22],[37,23,38,23],[37,24,38,25],[37,26,38,31],[33,2,35,8],[33,9,33,14],[33,15,33,20],[33,23,33,29],[34,9,34,14],[34,15,34,18],[43,2,43,11],[43,12,43,20],[43,24,43,25],[43,26,43,31],[44,2,45,21],[44,22,45,23],[44,24,45,25],[44,26,45,31],[41,2,41,11],[41,12,41,20],[41,24,41,25],[41,26,41,31],[42,2,42,11],[42,12,42,20],[42,24,42,25],[42,26,42,31],[48,21,48,25],[48,26,50,26],[48,27,50,31],[49,2,49,10],[49,11,49,16],[49,17,49,18],[49,21,50,25],[50,2,50,10],[50,11,50,16],[50,17,50,18]]}
[]
[]
[null,null,null,null,null,null,null,null,null,null,null,null,null,null,null,null,null,null,null,"納　　品　　書",null,null,null,null,null,"納品日","2023-10-01",null,null,null,null,null,null,null,null,"着色部をご記入ください"]
[null,null,"昭和コンクリート工業株式会社　殿"]
[null,null,null,null,null,null,null,null,null,null,null,null,null,null,null,null,null,null,null,null,null,null,"業者コード",11111,null,"登録番号","Ｔ","123456789123",null,null,null,null,null,1,"納品日ごとに作成してください。"]
[null,null,"申請事業所",null,null,null,null,null,null,1,null,null,null,null,null,"〇〇工場",null,null,null,null,null,null,null,null,null,null,null,null,null,null,null,null,null,2,"納入場所は納品書と受領書共にチェックを入れてください。"]
[null,null,"工　事　名",null,null,null,null,null,null,null,null,null,null,null,null,null,null,null,null,null,null,null,"納入業者名",null,null,null,null,null,null,null,null,null,null,null,"（その他の場合、納入場所を記入のこと）"]
[null,null,"納入場所",null,null,null,null,null,null,null,null,null,null,null,null,null,null,null,null,null,null,null,"住所","必ずご記入願います（ゴム印可）",null,null,null,null,null,null,null,null,null,3,"納入業者名は住所及び社名を必ず記入。（ゴム印使用可）"]
[null,null,null,null,null,null,null,null,null,null,null,null,null,null,null,{"$f":"IF(T9=\"\",\"\",VLOOKUP(T9,Sheet1!E5:F13,2,FALSE))","v":98105},null,null,null,"熊本工場",null,null,"社名",null,null,null,null,null,null,null,null,null,null,null,"社印の押印は省略とします。"]
[null,null,null,null,null,null,null,null,null,null,null,null,null,null,null,null,null,null,null,null,null,null,"下記の通り納品致しましたのでご査収願います。",null,null,null,null,null,null,null,null,null,null,4,"ご記入はオーダー表または、注文書の内容通り記載願います。"]
[null,null,null,null,null,null,null,null,null,null,null,null,null,null,null,null,null,null,null,null,null,null,null,null,null,null,null,null,null,null,null,null,null,null,"（資材コード欄はオーダー№を必ず記入。追加等でオーダー№が無い場合は資材コードを記入）"]
[null,null,"オーダーＮｏ．",null,null,null,null,null,null,null,null,null,"品名  　 規格　 　寸法",null,null,null,null,null,null,null,null,"単位","数  量","単　価","金　額",null,"備　考",null,null,null,null,null,null,null,"　＊規定桁数を超える番号の入力をするとエラーメッセージが表示されます。（0～999999999）"]
[null,null,null,null,null,null,null,null,null,null,null,null,null,null,null,null,null,null,null,null,null,null,null,null,null,null,null,null,null,null,null,null,null,5,"オーダー№の番号順の変更不可（末尾１からご記入下さい）"]
[null,null,4601001,null,null,null,null,null,null,null,null,null,"ＳＤ345　Ｄ10　3.0ｍ　1,200本",null,null,null,null,null,null,null,null,"㎏",3360,123,{"$f":"ROUND(W14*X14,0)","v":413280},null,null,null,null,null,null,null,null,6,"納品日・業者コード・注文日・注文№・発注者（調達担当者）は必ずご記入下さい。"]
[null,null,4501001,null,null,null,null,null,null,null,null,null,"ＳＤ295　Ｄ10　8.0ｍ　400本",null,null,null,null,null,null,null,null,"㎏",1792,110,{"$f":"ROUND(W15*X15,0)","v":197120},null,null,null,null,null,null,null,null,7,"記入された納品書は担当者へメールまたはＦＡＸにてお送り下さい。"]
[null,null,4551111,null,null,null,null,null,null,null,null,null,"値引き",null,null,null,null,null,null,null,null,"式",1,-400,{"$f":"ROUND(W16*X16,0)","v":-400}]
[null,null,null,null,null,null,null,null,null,null,null,null,null,null,null,null,null,null,null,null,null,null,null,null,{"$f":"ROUND(W17*X17,0)","v":0},null,null,null,null,null,null,null,null,8,"オーダーＮｏ．の無い工場向け鉄筋の番号について"]
[null,null,null,null,null,null,null,null,null,null,null,null,null,null,null,null,null,null,null,null,null,null,null,null,{"$f":"ROUND(W18*X18,0)","v":0},null,null,null,null,null,null,null,null,null,null,"SD345","D10　：　４６０１００１"]
[null,null,null,null,null,null,null,null,null,null,null,null,null,null,null,null,null,null,null,null,null,null,"税抜合計金額",null,{"$f":"SUM(Y14:Z18)","v":610000}]
[]
[]
[]
[null,null,null,null,null,null,null,null,null,null,null,null,null,null,null,null,null,null,null,null,null,null,null,"照合印","検収印",null,"入力者印",null,null,null,null,null,null,null,null,"SD295","D10　：　４５０１００１"]
[null,null,"受注日",null,null,null,null,null,null,null,null,"注文NO.",null,null,null,null,null,"発注者"]
[]
[]
[]
[]
[null,null,null,null,null,null,null,null,null,null,{"$f":"IF(K3=\"\",\"\",K3)","v":""},null,null,null,null,null,null,null,null,"受　　領　　書",null,null,null,null,null,"納品日",{"$f":"IF(AA3=\"\",\"\",AA3)","v":"2023-10-01"}]
[]
[null,null,null,null,null,null,null,null,null,null,null,null,null,null,null,null,null,null,null,null,null,null,"業者コード",{"$f":"IF(X5=\"\",\"\",X5)","v":11111},null,"登録番号",{"$f":"IF(AA5=\"\",\"\",AA5)","v":"Ｔ"},"123456789123","","","",""]
[null,null,"申請事業所",null,null,null,null,null,null,{"$f":"IF(J6=\"\",\"\",J6)","v":1},null,null,null,null,null,{"$f":"IF(P6=\"\",\"\",P6)","v":"〇〇工場"},null,null,null,null,null,null,null,{"$f":"IF(+X6=\"\",\"\",X6)","v":""}]
[null,null,"工　事　名",null,null,null,null,null,null,{"$f":"IF(J7=\"\",\"\",J7)","v":""},null,null,null,null,null,{"$f":"IF(P7=\"\",\"\",P7)","v":""},null,null,null,null,null,null,"納入業者名",{"$f":"IF(+X7=\"\",\"\",X7)","v":""}]
[null,null,"納入場所",null,null,null,null,null,null,{"$f":"IF(J8=\"\",\"\",J8)","v":""},null,null,null,null,null,{"$f":"IF(P8=\"\",\"\",P8)","v":""},null,null,null,null,null,null,{"$f":"IF(+W8=\"\",\"\",W8)","v":"住所"},{"$f":"IF(+X8=\"\",\"\",X8)","v":"必ずご記入願います（ゴム印可）"}]
[null,null,null,null,null,null,null,null,null,null,null,null,null,null,null,{"$f":"IF(P9=\"\",\"\",P9)","v":98105},null,null,null,{"$f":"IF(T9=\"\",\"\",T9)","v":"熊本工場"},null,null,{"$f":"IF(+W9=\"\",\"\",W9)","v":"社名"},{"$f":"IF(+X9=\"\",\"\",X9)","v":""},null,null,null,null,null,null,"御中"]
[null,null,null,null,null,null,null,null,null,null,null,null,null,null,null,{"$f":"IF(P10=\"\",\"\",P10)","v":""}]
[]
[null,null,"オーダー№",null,null,null,null,null,null,null,null,null,"品名  　 規格　 　寸法",null,null,null,null,null,null,null,null,"単位","数  量","単　価","金　額",null,"摘　要"]
[]
[null,null,{"$f":"IF(C14=\"\",\"\",C14)","v":4601001},null,null,null,null,null,null,null,null,null,{"$f":"IF(M14=\"\",\"\",M14)","v":"ＳＤ345　Ｄ10　3.0ｍ　1,200本"},null,null,null,null,null,null,null,null,{"$f":"IF(V14=\"\",\"\",V14)","v":"㎏"},3360,123,413280]
{"$rows_left_out":12}
{"sheet":"Sheet1","index":3,"n_rows":36,"n_cols":6,"rows_kept":36,"cut":false,"hidden":true,"merged":[]}
[]
[]
[null,null,"単位",null,"工場名","工場コード"]
[]
[null,1,"枚",null,"揖斐川工場",98101]
[null,2,"組",null,"福島工場",98103]
[null,3,"ｔ",null,"滋賀工場",98104]
[null,4,"個",null,"熊本工場",98105]
[null,5,"本",null,"新潟工場",98106]
[null,6,"式",null,"松本工場",98107]
[null,7,"ｍ",null,"秋田工場",98401]
[null,8,"㎥",null,"岩手工場",98402]
[null,9,"㎡",null,"宮城工場",98403]
[null,10,"㎏"]
[null,11,"缶"]
[null,12,"袋"]
[null,13,"L"]
[null,14,"巻"]
[null,15,"箱"]
[null,16,"回"]
[null,17,"日"]
[null,18,"基"]
[null,19,"棟"]
[null,20,"台"]
[null,21,"型"]
[null,22,"着"]
[null,23,"通"]
[null,24,"足"]
[null,25,"CS"]
[null,26,"ST"]
[null,27,"年"]
[null,28,"人"]
[null,29,"月"]
[null,30,"箇所"]
[null,31,"車"]
[null,32,"柵"]